RECOMMENDED: If you have Windows errors then we strongly recommend that you download and run this (Windows) Repair Tool.

Configuring R – "cannot compile a simple Fortran program" Jan 13, 2016: R. I recently had to install an older version of R (v3.1.2) from source for a specific project.

Sep 23, 2009. configure "cannot compile a simple Fortran program". for Fortran 77 name- mangling scheme. configure: error: > cannot compile a simple.

As you can see, the C program consists of two function definitions. In contrast to the Python program, where the print line exists outside any function definitions.

Grub Loading Error 22 Fixmbr Hallo! Ich hoffe ich bin hier im richtigen Forum. Ich bin neu hier und kenne

error upgrading R – `cannot compile a simple Fortran program. configure: error: cannot compile a simple Fortran program See `config.log' for more details.

To allow easy use of this existing code, Julia makes it simple and efficient to call C and Fortran. at compile-time. The following arguments, if any, are the actual argument values passed to the function. The C getenv function indicates an.

When compiled and run using Borland’s Turbo Basic on an IBM PC, the program prints Not Equal! This example will be analyzed in the next section

I'm trying to install gadgetviewer on my macbook, however when I run./configure prefix=/usr/local/bin after a load of output I get: checking for g_key_file_new in.

configure: error: cannot compile a simple Fortran program. libexec/gcc/i686-pc- linux-gnu/4.6.0/f951: error while loading shared libraries:.

Snow leopard./configure "cannot compile a simple Fortran program". I hope this is the place for this. I have to rebuild from scratch under Snow Leopard, and when I.

Feb 25, 2016. Ubuntu – Installing Octave, Fortran 77 error. configure: error: cannot compile a simple Fortran program See `config.log' for more details.".

Configuring R – "cannot compile a simple Fortran program" – Jan 13, 2016. Configuring R – "cannot compile a simple Fortran program". none checking for Fortran 77 name-mangling scheme. configure: error: in.

Belkin Setup Adsl Parameter Error We make people-inspired products and solutions. From wireless home networking and entertainment, to mobile accessories,

perlsyn. NAME DESCRIPTION. Declarations Comments Simple Statements Truth and Falsehood Statement Modifiers Compound Statements

Error Ora-01843 Mes No Vlido The "ORA-01843: not a valid month" error is quite common for Oracle SQL developers, and

RECOMMENDED: Click here to fix Windows errors and improve system performance

Author